Reaction Details
TargetRAC-alpha serine/threonine-protein kinase
LigandBDBM50170432
Substrate/Competitorn/a
Meas. Tech.ChEMBL_1577690 (CHEMBL3807471)
IC50 390±n/a nM
Citation Zhan, WXu, LDong, XDong, JYi, XMa, XQiu, NLi, JYang, BZhou, YHu, Y Design, synthesis and biological evaluation of pyrazol-furan carboxamide analogues as novel Akt kinase inhibitors. Eur J Med Chem117:47-58 (2016) 
 
RAC-alpha serine/threonine-protein kinase
Name:RAC-alpha serine/threonine-protein kinase
Type:Enzyme
Mol. Mass.:55681.25
Organism:Homo sapiens (Human)
Description:P31749
Residue:480
BDBM50170432
NameBDBM50170432
Synonyms:CHEMBL3805691
TypeSmall organic molecule
Emp. Form.C20H19Cl2FN4O2
Mol. Mass.437.295
SMILESCn1ncc(Cl)c1-c1cc(oc1Cl)C(=O)NC1(CCNCC1)c1ccc(F)cc1