Reaction Details
TargetIntegrase
LigandBDBM50170870
Substrate/Competitorn/a
Meas. Tech.ChEMBL_1577822 (CHEMBL3808056)
IC50 2.0±n/a nM
Citation Velthuisen, EJJohns, BATemelkoff, DPBrown, KWDanehower, SC The design of 8-hydroxyquinoline tetracyclic lactams as HIV-1 integrase strand transfer inhibitors. Eur J Med Chem117:99-112 (2016) 
 
Integrase
Name:Integrase
Synonyms:pol
Type:PROTEIN
Mol. Mass.:32203.43
Organism:Human immunodeficiency virus 1
Description:ChEMBL_106649
Residue:288
BDBM50170870
NameBDBM50170870
Synonyms:CHEMBL3805182
TypeSmall organic molecule
Emp. Form.C23H19ClFN3O3
Mol. Mass.439.867
SMILES[H][C@@]12CCCCN1C(=O)c1c2c(C(N)=O)c2cc(Cc3cccc(Cl)c3F)cnc2c1O