Reaction Details
TargetCytosol aminopeptidase [33-68,L62W]
LigandBDBM50170874
Substrate/Competitorn/a
Meas. Tech.ChEMBL_1577950 (CHEMBL3806574)
Ki 108000±n/a nM
Citation Weglarz-Tomczak, EBerlicki, LPawelczak, MNocek, BJoachimiak, AMucha, A A structural insight into the P1S1 binding mode of diaminoethylphosphonic and phosphinic acids, selective inhibitors of alanine aminopeptidases. Eur J Med Chem117:187-96 (2016) 
 
Cytosol aminopeptidase [33-68,L62W]
Name:Cytosol aminopeptidase [33-68,L62W]
Type:Enzyme
Mol. Mass.:4015.44
Organism:Sus scrofa (Pig)
Description:P28839[33-68,L62W]
Residue:36
BDBM50170874
NameBDBM50170874
Synonyms:CHEMBL3805544
TypeSmall organic molecule
Emp. Form.C10H17N2O3P
Mol. Mass.244.2273
SMILESNC(CNCCc1ccccc1)P(O)(O)=O