Reaction Details
TargetCytosol aminopeptidase [33-68,L62W]
LigandBDBM50170875
Substrate/Competitorn/a
Meas. Tech.ChEMBL_1577950 (CHEMBL3806574)
Ki 7020±n/a nM
Citation Weglarz-Tomczak, EBerlicki, LPawelczak, MNocek, BJoachimiak, AMucha, A A structural insight into the P1S1 binding mode of diaminoethylphosphonic and phosphinic acids, selective inhibitors of alanine aminopeptidases. Eur J Med Chem117:187-96 (2016) 
 
Cytosol aminopeptidase [33-68,L62W]
Name:Cytosol aminopeptidase [33-68,L62W]
Type:Enzyme
Mol. Mass.:4015.44
Organism:Sus scrofa (Pig)
Description:P28839[33-68,L62W]
Residue:36
BDBM50170875
NameBDBM50170875
Synonyms:CHEMBL3805288
TypeSmall organic molecule
Emp. Form.C9H16N3O3P
Mol. Mass.245.2154
SMILESNC(CNCc1ccc(N)cc1)P(O)(O)=O