Reaction Details
TargetCytosol aminopeptidase [33-68,L62W]
LigandBDBM50170876
Substrate/Competitorn/a
Meas. Tech.ChEMBL_1577950 (CHEMBL3806574)
Ki 26200±n/a nM
Citation Weglarz-Tomczak, EBerlicki, LPawelczak, MNocek, BJoachimiak, AMucha, A A structural insight into the P1S1 binding mode of diaminoethylphosphonic and phosphinic acids, selective inhibitors of alanine aminopeptidases. Eur J Med Chem117:187-96 (2016) 
 
Cytosol aminopeptidase [33-68,L62W]
Name:Cytosol aminopeptidase [33-68,L62W]
Type:Enzyme
Mol. Mass.:4015.44
Organism:Sus scrofa (Pig)
Description:P28839[33-68,L62W]
Residue:36
BDBM50170876
NameBDBM50170876
Synonyms:CHEMBL3805817
TypeSmall organic molecule
Emp. Form.C10H17N2O4P
Mol. Mass.260.2267
SMILESCOc1ccc(CNCC(N)P(O)(O)=O)cc1