Reaction Details
TargetAminopeptidase N
LigandBDBM50170894
Substrate/Competitorn/a
Meas. Tech.ChEMBL_1577952 (CHEMBL3806576)
Ki 9390±n/a nM
Citation Weglarz-Tomczak, EBerlicki, LPawelczak, MNocek, BJoachimiak, AMucha, A A structural insight into the P1S1 binding mode of diaminoethylphosphonic and phosphinic acids, selective inhibitors of alanine aminopeptidases. Eur J Med Chem117:187-96 (2016) 
 
Aminopeptidase N
Name:Aminopeptidase N
Type:Protein
Mol. Mass.:108810.25
Organism:Sus scrofa (Pig)
Description:P15145
Residue:963
BDBM50170894
NameBDBM50170894
Synonyms:CHEMBL3805338
TypeSmall organic molecule
Emp. Form.C8H20N3O3P
Mol. Mass.237.2365
SMILESNC(CNCC1CCNCC1)P(O)(O)=O