Reaction Details
TargetAminopeptidase N
LigandBDBM50170877
Substrate/Competitorn/a
Meas. Tech.ChEMBL_1577952 (CHEMBL3806576)
Ki 5420±n/a nM
Citation Weglarz-Tomczak, EBerlicki, LPawelczak, MNocek, BJoachimiak, AMucha, A A structural insight into the P1S1 binding mode of diaminoethylphosphonic and phosphinic acids, selective inhibitors of alanine aminopeptidases. Eur J Med Chem117:187-96 (2016) 
 
Aminopeptidase N
Name:Aminopeptidase N
Type:Protein
Mol. Mass.:108810.25
Organism:Sus scrofa (Pig)
Description:P15145
Residue:963
BDBM50170877
NameBDBM50170877
Synonyms:CHEMBL3804956
TypeSmall organic molecule
Emp. Form.C10H18N3O3P
Mol. Mass.259.242
SMILESNCc1ccc(CNCC(N)P(O)(O)=O)cc1