Reaction Details
TargetAminopeptidase N
LigandBDBM50170878
Substrate/Competitorn/a
Meas. Tech.ChEMBL_1577952 (CHEMBL3806576)
Ki 723±n/a nM
Citation Weglarz-Tomczak, EBerlicki, LPawelczak, MNocek, BJoachimiak, AMucha, A A structural insight into the P1S1 binding mode of diaminoethylphosphonic and phosphinic acids, selective inhibitors of alanine aminopeptidases. Eur J Med Chem117:187-96 (2016) 
 
Aminopeptidase N
Name:Aminopeptidase N
Type:Protein
Mol. Mass.:108810.25
Organism:Sus scrofa (Pig)
Description:P15145
Residue:963
BDBM50170878
NameBDBM50170878
Synonyms:CHEMBL3806197
TypeSmall organic molecule
Emp. Form.C11H19N2O4P
Mol. Mass.274.2533
SMILESCOc1ccc(CCNCC(N)P(O)(O)=O)cc1