Reaction Details
TargetAminopeptidase N
LigandBDBM50170876
Substrate/Competitorn/a
Meas. Tech.ChEMBL_1577953 (CHEMBL3806577)
Ki 357±n/a nM
Citation Weglarz-Tomczak, EBerlicki, LPawelczak, MNocek, BJoachimiak, AMucha, A A structural insight into the P1S1 binding mode of diaminoethylphosphonic and phosphinic acids, selective inhibitors of alanine aminopeptidases. Eur J Med Chem117:187-96 (2016) 
 
Aminopeptidase N
Name:Aminopeptidase N
Type:PROTEIN
Mol. Mass.:109522.63
Organism:Homo sapiens (Human)
Description:ChEMBL_1507526
Residue:967
BDBM50170876
NameBDBM50170876
Synonyms:CHEMBL3805817
TypeSmall organic molecule
Emp. Form.C10H17N2O4P
Mol. Mass.260.2267
SMILESCOc1ccc(CNCC(N)P(O)(O)=O)cc1