Reaction Details
TargetAminopeptidase N
LigandBDBM50170884
Substrate/Competitorn/a
Meas. Tech.ChEMBL_1577953 (CHEMBL3806577)
Ki 78±n/a nM
Citation Weglarz-Tomczak, EBerlicki, LPawelczak, MNocek, BJoachimiak, AMucha, A A structural insight into the P1S1 binding mode of diaminoethylphosphonic and phosphinic acids, selective inhibitors of alanine aminopeptidases. Eur J Med Chem117:187-96 (2016) 
 
Aminopeptidase N
Name:Aminopeptidase N
Type:PROTEIN
Mol. Mass.:109522.63
Organism:Homo sapiens (Human)
Description:ChEMBL_1507526
Residue:967
BDBM50170884
NameBDBM50170884
Synonyms:CHEMBL3805495
TypeSmall organic molecule
Emp. Form.C21H29N2O5P
Mol. Mass.420.4391
SMILESCOc1ccc(CCNCC(N)P(O)(=O)CC(Cc2ccccc2)C(O)=O)cc1