Reaction Details
TargetCytosol aminopeptidase [33-68,L62W]
LigandBDBM50170897
Substrate/Competitorn/a
Meas. Tech.ChEMBL_1577950 (CHEMBL3806574)
Ki 20800±n/a nM
Citation Weglarz-Tomczak, EBerlicki, LPawelczak, MNocek, BJoachimiak, AMucha, A A structural insight into the P1S1 binding mode of diaminoethylphosphonic and phosphinic acids, selective inhibitors of alanine aminopeptidases. Eur J Med Chem117:187-96 (2016) 
 
Cytosol aminopeptidase [33-68,L62W]
Name:Cytosol aminopeptidase [33-68,L62W]
Type:Enzyme
Mol. Mass.:4015.44
Organism:Sus scrofa (Pig)
Description:P28839[33-68,L62W]
Residue:36
BDBM50170897
NameBDBM50170897
Synonyms:CHEMBL3805573
TypeSmall organic molecule
Emp. Form.C9H21N2O3P
Mol. Mass.236.2484
SMILESNC(CNC1CCCCCC1)P(O)(O)=O