Reaction Details
TargetIntegrase
LigandBDBM50170904
Substrate/Competitorn/a
Meas. Tech.ChEBML_1578163
IC50 860±n/a nM
Citation Billamboz, MSuchaud, VBailly, FLion, CAndréola, MLChrist, FDebyser, ZCotelle, P 2-hydroxyisoquinoline-1,3(2H,4H)-diones (HIDs) as human immunodeficiency virus type 1 integrase inhibitors: Influence of the alkylcarboxamide substitution of position 4. Eur J Med Chem117:256-68 (2016) 
 
Integrase
Name:Integrase
Synonyms:pol
Type:PROTEIN
Mol. Mass.:32203.43
Organism:Human immunodeficiency virus 1
Description:ChEMBL_106649
Residue:288
BDBM50170904
NameBDBM50170904
Synonyms:CHEMBL3805505
TypeSmall organic molecule
Emp. Form.C17H22N2O4
Mol. Mass.318.3676
SMILESCCCCCCCNC(=O)C1C(=O)N(O)C(=O)c2ccccc12