Reaction Details
TargetIntegrase
LigandBDBM50170914
Substrate/Competitorn/a
Meas. Tech.ChEMBL_1578163 (CHEMBL3807245)
IC50 1820±n/a nM
Citation Billamboz, MSuchaud, VBailly, FLion, CAndréola, MLChrist, FDebyser, ZCotelle, P 2-hydroxyisoquinoline-1,3(2H,4H)-diones (HIDs) as human immunodeficiency virus type 1 integrase inhibitors: Influence of the alkylcarboxamide substitution of position 4. Eur J Med Chem117:256-68 (2016) 
 
Integrase
Name:Integrase
Synonyms:pol
Type:PROTEIN
Mol. Mass.:32203.43
Organism:Human immunodeficiency virus 1
Description:ChEMBL_106649
Residue:288
BDBM50170914
NameBDBM50170914
Synonyms:CHEMBL3805355
TypeSmall organic molecule
Emp. Form.C13H14N2O4
Mol. Mass.262.2613
SMILESCCCNC(=O)C1C(=O)N(O)C(=O)c2ccccc12