Reaction Details
TargetCytochrome P450 2C9
LigandBDBM50090677
Substrate/Competitorn/a
Meas. Tech.ChEMBL_1578177 (CHEMBL3807259)
IC50 180±n/a nM
Citation Billamboz, MSuchaud, VBailly, FLion, CAndréola, MLChrist, FDebyser, ZCotelle, P 2-hydroxyisoquinoline-1,3(2H,4H)-diones (HIDs) as human immunodeficiency virus type 1 integrase inhibitors: Influence of the alkylcarboxamide substitution of position 4. Eur J Med Chem117:256-68 (2016) 
 
Cytochrome P450 2C9
Name:Cytochrome P450 2C9
Type:Enzyme
Mol. Mass.:55636.33
Organism:Homo sapiens (Human)
Description:P11712
Residue:490
BDBM50090677
NameBDBM50090677
Synonyms:4-Amino-N-(2-phenyl-2H-pyrazol-3-yl)-benzenesulfonamide CHEMBL1109 Sulfabid US9180183, Sulfaphenazole
TypeSmall organic molecule
Emp. Form.C15H14N4O2S
Mol. Mass.314.362
SMILESNc1ccc(cc1)S(=O)(=O)Nc1ccnn1-c1ccccc1