Reaction Details
TargetIntegrase
LigandBDBM50170908
Substrate/Competitorn/a
Meas. Tech.ChEMBL_1578163 (CHEMBL3807245)
IC50 700±n/a nM
Citation Billamboz, MSuchaud, VBailly, FLion, CAndréola, MLChrist, FDebyser, ZCotelle, P 2-hydroxyisoquinoline-1,3(2H,4H)-diones (HIDs) as human immunodeficiency virus type 1 integrase inhibitors: Influence of the alkylcarboxamide substitution of position 4. Eur J Med Chem117:256-68 (2016) 
 
Integrase
Name:Integrase
Synonyms:pol
Type:PROTEIN
Mol. Mass.:32203.43
Organism:Human immunodeficiency virus 1
Description:ChEMBL_106649
Residue:288
BDBM50170908
NameBDBM50170908
Synonyms:CHEMBL3805115
TypeSmall organic molecule
Emp. Form.C16H18N2O4
Mol. Mass.302.3251
SMILESON1C(=O)C(C(=O)NC2CCCCC2)c2ccccc2C1=O