Reaction Details
TargetAcyl-protein thioesterase 1
LigandBDBM50170931
Substrate/Competitorn/a
Meas. Tech.ChEMBL_1578295 (CHEMBL3807663)
IC50 4600±n/a nM
Citation Cox, JMChu, HDKuethe, JTGao, YDScapin, GEiermann, GHe, HLi, XLyons, KAMetzger, JPetrov, AWu, JKXu, SSinha-Roy, RWeber, AEBiftu, T The discovery of novel 5,6,5- and 5,5,6-tricyclic pyrrolidines as potent and selective DPP-4 inhibitors. Bioorg Med Chem Lett26:2622-6 (2016) 
 
Acyl-protein thioesterase 1
Name:Acyl-protein thioesterase 1
Type:PROTEIN
Mol. Mass.:24708.49
Organism:Rattus norvegicus
Description:ChEMBL_12731
Residue:230
BDBM50170931
NameBDBM50170931
Synonyms:CHEMBL3805871
TypeSmall organic molecule
Emp. Form.C21H19F6N5
Mol. Mass.455.3995
SMILESN[C@H]1C[C@H](CC[C@@H]1c1cc(F)c(F)cc1F)N1Cc2nn3ccc(nc3c2C1)C(F)(F)F