Reaction Details
TargetCarbonic anhydrase 1
LigandBDBM50171183
Substrate/Competitorn/a
Meas. Tech.ChEMBL_1576948 (CHEMBL3806791)
Ki 310±n/a nM
Citation Chandak, NCeruso, MSupuran, CTSharma, PK Novel sulfonamide bearing coumarin scaffolds as selective inhibitors of tumor associated carbonic anhydrase isoforms IX and XII. Bioorg Med Chem24:2882-2886 (2016) 
 
Carbonic anhydrase 1
Name:Carbonic anhydrase 1
Type:Enzyme
Mol. Mass.:28873.37
Organism:Homo sapiens (Human)
Description:P00915
Residue:261
BDBM50171183
NameBDBM50171183
Synonyms:CHEMBL3805723
TypeSmall organic molecule
Emp. Form.C29H22N6O5S2
Mol. Mass.598.652
SMILESCOc1ccc(cc1)-c1nn(cc1\C=N/Nc1nc(cs1)-c1cc2ccccc2oc1=O)-c1ccc(cc1)S(N)(=O)=O