Reaction Details
TargetCarbonic anhydrase 1
LigandBDBM50171184
Substrate/Competitorn/a
Meas. Tech.ChEMBL_1576948 (CHEMBL3806791)
Ki 273±n/a nM
Citation Chandak, NCeruso, MSupuran, CTSharma, PK Novel sulfonamide bearing coumarin scaffolds as selective inhibitors of tumor associated carbonic anhydrase isoforms IX and XII. Bioorg Med Chem24:2882-2886 (2016) 
 
Carbonic anhydrase 1
Name:Carbonic anhydrase 1
Type:Enzyme
Mol. Mass.:28873.37
Organism:Homo sapiens (Human)
Description:P00915
Residue:261
BDBM50171184
NameBDBM50171184
Synonyms:CHEMBL3806010
TypeSmall organic molecule
Emp. Form.C29H21BrN6O4S2
Mol. Mass.661.549
SMILESCc1ccc(cc1)-c1nn(cc1\C=N/Nc1nc(cs1)-c1cc2cc(Br)ccc2oc1=O)-c1ccc(cc1)S(N)(=O)=O