Reaction Details
TargetCarbonic anhydrase 2
LigandBDBM50171198
Substrate/Competitorn/a
Meas. Tech.ChEMBL_1576949 (CHEMBL3806792)
Ki 1150±n/a nM
Citation Chandak, NCeruso, MSupuran, CTSharma, PK Novel sulfonamide bearing coumarin scaffolds as selective inhibitors of tumor associated carbonic anhydrase isoforms IX and XII. Bioorg Med Chem24:2882-2886 (2016) 
 
Carbonic anhydrase 2
Name:Carbonic anhydrase 2
Type:Enzyme
Mol. Mass.:29250.71
Organism:Homo sapiens (Human)
Description:P00918
Residue:260
BDBM50171198
NameBDBM50171198
Synonyms:CHEMBL3804869
TypeSmall organic molecule
Emp. Form.C18H12BrN3O4S2
Mol. Mass.478.34
SMILESNS(=O)(=O)c1ccc(Nc2nc(cs2)-c2cc3cc(Br)ccc3oc2=O)cc1