Reaction Details
TargetCarbonic anhydrase 2
LigandBDBM50171201
Substrate/Competitorn/a
Meas. Tech.ChEMBL_1576949 (CHEMBL3806792)
Ki 105±n/a nM
Citation Chandak, NCeruso, MSupuran, CTSharma, PK Novel sulfonamide bearing coumarin scaffolds as selective inhibitors of tumor associated carbonic anhydrase isoforms IX and XII. Bioorg Med Chem24:2882-2886 (2016) 
 
Carbonic anhydrase 2
Name:Carbonic anhydrase 2
Type:Enzyme
Mol. Mass.:29250.71
Organism:Homo sapiens (Human)
Description:P00918
Residue:260
BDBM50171201
NameBDBM50171201
Synonyms:CHEMBL2316108
TypeSmall organic molecule
Emp. Form.C18H10BrN3O4S2
Mol. Mass.476.324
SMILESNS(=O)(=O)c1ccc2c(c1)sc1nc(cn21)-c1cc2cc(Br)ccc2oc1=O