Reaction Details
TargetCarbonic anhydrase 9
LigandBDBM50171182
Substrate/Competitorn/a
Meas. Tech.ChEMBL_1576950 (CHEMBL3806793)
Ki 20±n/a nM
Citation Chandak, NCeruso, MSupuran, CTSharma, PK Novel sulfonamide bearing coumarin scaffolds as selective inhibitors of tumor associated carbonic anhydrase isoforms IX and XII. Bioorg Med Chem24:2882-2886 (2016) 
 
Carbonic anhydrase 9
Name:Carbonic anhydrase 9
Type:Enzyme
Mol. Mass.:49669.03
Organism:Homo sapiens (Human)
Description:Catalytic domain of human cloned isozyme was used in the assay
Residue:459
BDBM50171182
NameBDBM50171182
Synonyms:CHEMBL3805545
TypeSmall organic molecule
Emp. Form.C29H21ClN6O5S2
Mol. Mass.633.097
SMILESCOc1ccc(cc1)-c1nn(cc1\C=N/Nc1nc(cs1)-c1cc2cc(Cl)ccc2oc1=O)-c1ccc(cc1)S(N)(=O)=O