Reaction Details
TargetCarbonic anhydrase 9
LigandBDBM50171181
Substrate/Competitorn/a
Meas. Tech.ChEMBL_1576950 (CHEMBL3806793)
Ki 20±n/a nM
Citation Chandak, NCeruso, MSupuran, CTSharma, PK Novel sulfonamide bearing coumarin scaffolds as selective inhibitors of tumor associated carbonic anhydrase isoforms IX and XII. Bioorg Med Chem24:2882-2886 (2016) 
 
Carbonic anhydrase 9
Name:Carbonic anhydrase 9
Type:Enzyme
Mol. Mass.:49669.03
Organism:Homo sapiens (Human)
Description:Catalytic domain of human cloned isozyme was used in the assay
Residue:459
BDBM50171181
NameBDBM50171181
Synonyms:CHEMBL3806081
TypeSmall organic molecule
Emp. Form.C29H21BrN6O5S2
Mol. Mass.677.548
SMILESCOc1ccc(cc1)-c1nn(cc1\C=N/Nc1nc(cs1)-c1cc2cc(Br)ccc2oc1=O)-c1ccc(cc1)S(N)(=O)=O