Reaction Details
TargetCarbonic anhydrase 9
LigandBDBM50171200
Substrate/Competitorn/a
Meas. Tech.ChEMBL_1576950 (CHEMBL3806793)
Ki 11±n/a nM
Citation Chandak, NCeruso, MSupuran, CTSharma, PK Novel sulfonamide bearing coumarin scaffolds as selective inhibitors of tumor associated carbonic anhydrase isoforms IX and XII. Bioorg Med Chem24:2882-2886 (2016) 
 
Carbonic anhydrase 9
Name:Carbonic anhydrase 9
Type:Enzyme
Mol. Mass.:49669.03
Organism:Homo sapiens (Human)
Description:Catalytic domain of human cloned isozyme was used in the assay
Residue:459
BDBM50171200
NameBDBM50171200
Synonyms:CHEMBL2316107
TypeSmall organic molecule
Emp. Form.C18H10ClN3O4S2
Mol. Mass.431.873
SMILESNS(=O)(=O)c1ccc2c(c1)sc1nc(cn21)-c1cc2cc(Cl)ccc2oc1=O