Reaction Details
TargetCarbonic anhydrase 12
LigandBDBM50171186
Substrate/Competitorn/a
Meas. Tech.ChEMBL_1576951 (CHEMBL3806794)
Ki 55±n/a nM
Citation Chandak, NCeruso, MSupuran, CTSharma, PK Novel sulfonamide bearing coumarin scaffolds as selective inhibitors of tumor associated carbonic anhydrase isoforms IX and XII. Bioorg Med Chem24:2882-2886 (2016) 
 
Carbonic anhydrase 12
Name:Carbonic anhydrase 12
Type:Enzyme
Mol. Mass.:39456.00
Organism:Homo sapiens (Human)
Description:Catalytic domain of human cloned isozyme was used in the assay
Residue:354
BDBM50171186
NameBDBM50171186
Synonyms:CHEMBL3805080
TypeSmall organic molecule
Emp. Form.C29H22N6O4S2
Mol. Mass.582.653
SMILESCc1ccc(cc1)-c1nn(cc1\C=N/Nc1nc(cs1)-c1cc2ccccc2oc1=O)-c1ccc(cc1)S(N)(=O)=O