Reaction Details
TargetCarbonic anhydrase 12
LigandBDBM50171201
Substrate/Competitorn/a
Meas. Tech.ChEMBL_1576951 (CHEMBL3806794)
Ki 3.5±n/a nM
Citation Chandak, NCeruso, MSupuran, CTSharma, PK Novel sulfonamide bearing coumarin scaffolds as selective inhibitors of tumor associated carbonic anhydrase isoforms IX and XII. Bioorg Med Chem24:2882-2886 (2016) 
 
Carbonic anhydrase 12
Name:Carbonic anhydrase 12
Type:Enzyme
Mol. Mass.:39456.00
Organism:Homo sapiens (Human)
Description:Catalytic domain of human cloned isozyme was used in the assay
Residue:354
BDBM50171201
NameBDBM50171201
Synonyms:CHEMBL2316108
TypeSmall organic molecule
Emp. Form.C18H10BrN3O4S2
Mol. Mass.476.324
SMILESNS(=O)(=O)c1ccc2c(c1)sc1nc(cn21)-c1cc2cc(Br)ccc2oc1=O