Reaction Details
TargetCarbonic anhydrase 12
LigandBDBM50171206
Substrate/Competitorn/a
Meas. Tech.ChEMBL_1576951 (CHEMBL3806794)
Ki 0.620000±n/a nM
Citation Chandak, NCeruso, MSupuran, CTSharma, PK Novel sulfonamide bearing coumarin scaffolds as selective inhibitors of tumor associated carbonic anhydrase isoforms IX and XII. Bioorg Med Chem24:2882-2886 (2016) 
 
Carbonic anhydrase 12
Name:Carbonic anhydrase 12
Type:Enzyme
Mol. Mass.:39456.00
Organism:Homo sapiens (Human)
Description:Catalytic domain of human cloned isozyme was used in the assay
Residue:354
BDBM50171206
NameBDBM50171206
Synonyms:CHEMBL3805919
TypeSmall organic molecule
Emp. Form.C17H14BrN3O4S
Mol. Mass.436.28
SMILESC\C(=N/Nc1ccc(cc1)S(N)(=O)=O)c1cc2cc(Br)ccc2oc1=O