Reaction Details
TargetCarbonic anhydrase 1
LigandBDBM50171198
Substrate/Competitorn/a
Meas. Tech.ChEMBL_1576948 (CHEMBL3806791)
Ki 247±n/a nM
Citation Chandak, NCeruso, MSupuran, CTSharma, PK Novel sulfonamide bearing coumarin scaffolds as selective inhibitors of tumor associated carbonic anhydrase isoforms IX and XII. Bioorg Med Chem24:2882-2886 (2016) 
 
Carbonic anhydrase 1
Name:Carbonic anhydrase 1
Type:Enzyme
Mol. Mass.:28873.37
Organism:Homo sapiens (Human)
Description:P00915
Residue:261
BDBM50171198
NameBDBM50171198
Synonyms:CHEMBL3804869
TypeSmall organic molecule
Emp. Form.C18H12BrN3O4S2
Mol. Mass.478.34
SMILESNS(=O)(=O)c1ccc(Nc2nc(cs2)-c2cc3cc(Br)ccc3oc2=O)cc1