Reaction Details
TargetRAF proto-oncogene serine/threonine-protein kinase
LigandBDBM50172059
Substrate/Competitorn/a
Meas. Tech.ChEMBL_1577193 (CHEMBL3807567)
IC50 6800±n/a nM
Citation Yang, YSYang, BZou, YLi, GZhu, HL Design, biological evaluation and 3D QSAR studies of novel dioxin-containing triaryl pyrazoline derivatives as potential B-Raf inhibitors. Bioorg Med Chem24:3052-3061 (2016) 
 
RAF proto-oncogene serine/threonine-protein kinase
Name:RAF proto-oncogene serine/threonine-protein kinase
Type:PROTEIN
Mol. Mass.:72947.25
Organism:Mus musculus
Description:ChEMBL_116790
Residue:648
BDBM50172059
NameBDBM50172059
Synonyms:CHEMBL3805508
TypeSmall organic molecule
Emp. Form.C30H26N2O3
Mol. Mass.462.539
SMILESC(Oc1cccc(c1)C1CC(=NN1c1ccccc1)c1ccc2OCCOc2c1)c1ccccc1