Reaction Details
TargetTyrosine-protein kinase receptor UFO
LigandBDBM4552
Substrate/Competitorn/a
Meas. Tech.ChEMBL_1580722 (CHEMBL3811327)
IC50 340±n/a nM
Citation Myers, SHBrunton, VGUnciti-Broceta, A AXL Inhibitors in Cancer: A Medicinal Chemistry Perspective. J Med Chem59:3593-608 (2016) 
 
Tyrosine-protein kinase receptor UFO
Name:Tyrosine-protein kinase receptor UFO
Type:Enzyme
Mol. Mass.:98316.97
Organism:Homo sapiens (Human)
Description:P30530
Residue:894
BDBM4552
NameBDBM4552
Synonyms:4-[(2,4-Dichloro-5-methoxyphenyl)amino]-6-methoxy-7-[3-(4-methyl-1-piperazinyl)propoxy]-3-quinolinecarbonitrile BOSUTINIB SKI-606
TypeSmall organic molecule
Emp. Form.C26H29Cl2N5O3
Mol. Mass.530.446
SMILESCOc1cc(Nc2c(cnc3cc(OCCCN4CCN(C)CC4)c(OC)cc23)C#N)c(Cl)cc1Cl