Reaction Details
TargetHepatocyte growth factor receptor
LigandBDBM24498
Substrate/Competitorn/a
Meas. Tech.ChEMBL_1580738 (CHEMBL3811343)
IC50 1.000000±n/a nM
Citation Myers, SHBrunton, VGUnciti-Broceta, A AXL Inhibitors in Cancer: A Medicinal Chemistry Perspective. J Med Chem59:3593-608 (2016) 
 
Hepatocyte growth factor receptor
Name:Hepatocyte growth factor receptor
Type:Protein
Mol. Mass.:155559.73
Organism:Homo sapiens (Human)
Description:P08581
Residue:1390
BDBM24498
NameBDBM24498
Synonyms:3-(3-fluoro-4-{[2-(1-methyl-1H-imidazol-4-yl)thieno[3,2-b]pyridin-7-yl]oxy}phenyl)-1-(2-phenylacetyl)thiourea US10464902, MGCD-265 | thieno[3,2-b]pyridine-based inhibitor, 10a
TypeSmall organic molecule
Emp. Form.C26H20FN5O2S2
Mol. Mass.517.598
SMILESCn1cnc(c1)-c1cc2nccc(Oc3ccc(NC(=S)NC(=O)Cc4ccccc4)cc3F)c2s1