Reaction Details
TargetHepatocyte growth factor receptor
LigandBDBM50248510
Substrate/Competitorn/a
Meas. Tech.ChEMBL_1580733 (CHEMBL3811338)
IC50 1.3±n/a nM
Citation Myers, SHBrunton, VGUnciti-Broceta, A AXL Inhibitors in Cancer: A Medicinal Chemistry Perspective. J Med Chem59:3593-608 (2016) 
 
Hepatocyte growth factor receptor
Name:Hepatocyte growth factor receptor
Type:Protein
Mol. Mass.:155559.73
Organism:Homo sapiens (Human)
Description:P08581
Residue:1390
BDBM50248510
NameBDBM50248510
Synonyms:CHEMBL489326 | N-(4-(6,7-dimethoxyquinolin-4-yloxy)-3-fluorophenyl)-N-(4-fluorophenyl)cyclopropane-1,1-dicarboxamide
TypeSmall organic molecule
Emp. Form.C28H23F2N3O5
Mol. Mass.519.4961
SMILESCOc1cc2nccc(Oc3ccc(NC(=O)C4(CC4)C(=O)Nc4ccc(F)cc4)cc3F)c2cc1OC