Reaction Details
TargetTyrosinase
LigandBDBM7462
Substrate/Competitorn/a
Meas. Tech.ChEMBL_1581176 (CHEMBL3810649)
IC50 1000±n/a nM
Citation Ji, SLi, ZSong, WWang, YLiang, WLi, KTang, SWang, QQiao, XZhou, DYu, SYe, M Bioactive Constituents of Glycyrrhiza uralensis (Licorice): Discovery of the Effective Components of a Traditional Herbal Medicine. J Nat Prod79:281-92 (2016) 
 
Tyrosinase
Name:Tyrosinase
Type:Protein
Mol. Mass.:60388.08
Organism:Homo sapiens (Human)
Description:P14679
Residue:529
BDBM7462
NameBDBM7462
Synonyms:3,5,7-trihydroxy-2-(4-hydroxyphenyl)-4H-chromen-4-one CHEMBL150 Kaempferol (Kmp) kaempferol
TypeSmall organic molecule
Emp. Form.C15H10O6
Mol. Mass.286.2363
SMILESOc1ccc(cc1)-c1oc2cc(O)cc(O)c2c(=O)c1O