Reaction Details
TargetDual specificity tyrosine-phosphorylation-regulated kinase 3
LigandBDBM50172243
Substrate/Competitorn/a
Meas. Tech.ChEMBL_1579509 (CHEMBL3810707)
IC50 40±n/a nM
Citation Dowling, JEAlimzhanov, MBao, LChuaqui, CDenz, CRJenkins, ELarsen, NALyne, PDPontz, TYe, QHoldgate, GASnow, LO'Connell, NFerguson, AD Potent and Selective CK2 Kinase Inhibitors with Effects on Wnt Pathway Signaling in Vivo. ACS Med Chem Lett7:300-5 (2016) 
 
Dual specificity tyrosine-phosphorylation-regulated kinase 3
Name:Dual specificity tyrosine-phosphorylation-regulated kinase 3
Type:PROTEIN
Mol. Mass.:65747.26
Organism:Homo sapiens (Human)
Description:ChEMBL_1508026
Residue:588
BDBM50172243
NameBDBM50172243
Synonyms:CHEMBL3103192
TypeSmall organic molecule
Emp. Form.C21H25N9O
Mol. Mass.419.4829
SMILESCN(CCN)c1ccc(Nc2cc(NC3CC3)n3ncc(C#N)c3n2)cc1NC(C)=O