Reaction Details
TargetBreakpoint cluster region protein/Tyrosine-protein kinase ABL1
LigandBDBM50172492
Substrate/Competitorn/a
Meas. Tech.ChEMBL_1581201 (CHEMBL3810823)
EC50 1.8±n/a nM
Citation Daydé-Cazals, BFauvel, BSinger, MFeneyrolles, CBestgen, BGassiot, FSpenlinhauer, AWarnault, PVan Hijfte, NBorjini, NChevé, GYasri, A Rational Design, Synthesis, and Biological Evaluation of 7-Azaindole Derivatives as Potent Focused Multi-Targeted Kinase Inhibitors. J Med Chem59:3886-905 (2016) 
 
Breakpoint cluster region protein/Tyrosine-protein kinase ABL1
Name:Breakpoint cluster region protein/Tyrosine-protein kinase ABL1
Type:Enzyme
Mol. Mass.:n/a
Description:n/a
Components:This complex has 2 components.
Component 1
Name:Tyrosine-protein kinase ABL1
Synonyms:ABL ABL1_HUMAN JTK7 Proto-oncogene tyrosine-protein kinase ABL1 Tyrosine-protein kinase ABL V-abl Abelson murine leukemia viral oncogene homolog 1 p150 | tyrosine-protein kinase ABL1 isoform a
Type:Enzyme
Mol. Mass.:122897.30
Organism:Homo sapiens (Human)
Description:P00519
Residue:1130
Component 2
Name:Breakpoint cluster region protein
Synonyms:BCR BCR_HUMAN Breakpoint cluster region protein | D22S11
Type:PROTEIN
Mol. Mass.:142824.75
Organism:Homo sapiens (Human)
Description:ChEMBL_305348
Residue:1271
BDBM50172492
NameBDBM50172492
Synonyms:CHEMBL3808884
TypeSmall organic molecule
Emp. Form.C29H25F3N6O3
Mol. Mass.562.5424
SMILESCOC(=O)c1cc2cc(NCc3cc(NC(=O)c4cc(cc(c4)C(F)(F)F)-n4cnc(C)c4)ccc3C)cnc2[nH]1