Reaction Details
TargetCoagulation factor XI
LigandBDBM50172757
Substrate/Competitorn/a
Meas. Tech.ChEMBL_1578579 (CHEMBL3811620)
Ki>14200±n/a nM
Citation Glunz, PWMueller, LCheney, DLLadziata, VZou, YWurtz, NRWei, AWong, PCWexler, RRPriestley, ES Atropisomer Control in Macrocyclic Factor VIIa Inhibitors. J Med Chem59:4007-18 (2016) 
 
Coagulation factor XI
Name:Coagulation factor XI
Type:Enzyme
Mol. Mass.:70130.58
Organism:Homo sapiens (Human)
Description:P03951
Residue:625
BDBM50172757
NameBDBM50172757
Synonyms:CHEMBL3808801
TypeSmall organic molecule
Emp. Form.C30H31N5O3
Mol. Mass.509.5988
SMILESCN1Cc2cccc(NC(=O)OCC(C)(C)c3ccc(cc3)[C@@H](Nc3ccc4c(N)nccc4c3)C1=O)c2