Reaction Details
TargetCoagulation factor XI
LigandBDBM50172786
Substrate/Competitorn/a
Meas. Tech.ChEMBL_1578579 (CHEMBL3811620)
Ki>14200±n/a nM
Citation Glunz, PWMueller, LCheney, DLLadziata, VZou, YWurtz, NRWei, AWong, PCWexler, RRPriestley, ES Atropisomer Control in Macrocyclic Factor VIIa Inhibitors. J Med Chem59:4007-18 (2016) 
 
Coagulation factor XI
Name:Coagulation factor XI
Type:Enzyme
Mol. Mass.:70130.58
Organism:Homo sapiens (Human)
Description:P03951
Residue:625
BDBM50172786
NameBDBM50172786
Synonyms:CHEMBL3809909
TypeSmall organic molecule
Emp. Form.C29H29N5O3
Mol. Mass.495.5723
SMILESCC1(C)COC(=O)Nc2cccc(CNC(=O)[C@H](Nc3ccc4c(N)nccc4c3)c3ccc1cc3)c2