Reaction Details
TargetCoagulation factor VII/Tissue factor
LigandBDBM50172727
Substrate/Competitorn/a
Meas. Tech.ChEMBL_1578577 (CHEMBL3811618)
Ki 46±n/a nM
Citation Glunz, PWMueller, LCheney, DLLadziata, VZou, YWurtz, NRWei, AWong, PCWexler, RRPriestley, ES Atropisomer Control in Macrocyclic Factor VIIa Inhibitors. J Med Chem59:4007-18 (2016) 
 
Coagulation factor VII/Tissue factor
Name:Coagulation factor VII/Tissue factor
Type:n/a
Mol. Mass.:n/a
Description:ASSAY_ID of EBI is 69535
Components:This complex has 2 components.
Component 1
Name:Tissue factor
Synonyms:CD_antigen=CD142 Coagulation factor VII/tissue factor TF Thromboplastin | Tissue factor
Type:PROTEIN
Mol. Mass.:33067.61
Organism:Homo sapiens (Human)
Description:ChEMBL_936735
Residue:295
Component 2
Name:Coagulation factor VII
Synonyms:Eptacog alfa FA7_HUMAN Factor VIIa (fVIIa) SPCA serum prothrombin conversion accelerator
Type:Enzyme
Mol. Mass.:51599.89
Organism:Homo sapiens (Human)
Description:n/a
Residue:466
BDBM50172727
NameBDBM50172727
Synonyms:CHEMBL3808853
TypeSmall organic molecule
Emp. Form.C28H27N5O3
Mol. Mass.481.5457
SMILESCC1COC(=O)Nc2cccc(CNC(=O)C(Nc3ccc4c(N)nccc4c3)c3ccc1cc3)c2