Reaction Details
TargetProthrombin
LigandBDBM50172789
Substrate/Competitorn/a
Meas. Tech.ChEMBL_1578580 (CHEMBL3811621)
Ki>11500±n/a nM
Citation Glunz, PWMueller, LCheney, DLLadziata, VZou, YWurtz, NRWei, AWong, PCWexler, RRPriestley, ES Atropisomer Control in Macrocyclic Factor VIIa Inhibitors. J Med Chem59:4007-18 (2016) 
 
Prothrombin
Name:Prothrombin
Type:Protein
Mol. Mass.:70029.57
Organism:Homo sapiens (Human)
Description:P00734
Residue:622
BDBM50172789
NameBDBM50172789
Synonyms:CHEMBL3809344
TypeSmall organic molecule
Emp. Form.C29H29N5O3
Mol. Mass.495.5723
SMILESCC1(C)COC(=O)Nc2cccc(CNC(=O)[C@@H](Nc3ccc4c(N)nccc4c3)c3ccc1cc3)c2