Reaction Details
TargetAlpha-1B adrenergic receptor
LigandBDBM50172991
Substrate/Competitorn/a
Meas. Tech.ChEMBL_1579181 (CHEMBL3812084)
IC50 2768±n/a nM
Citation Zhao, FLi, JChen, YTian, YWu, CXie, YZhou, YWang, JXie, XLiu, H Design, Synthesis, and Biological Evaluation of Indoline and Indole Derivatives as Potent and Selectivea1A-Adrenoceptor Antagonists. J Med Chem59:3826-39 (2016) 
 
Alpha-1B adrenergic receptor
Name:Alpha-1B adrenergic receptor
Type:Enzyme
Mol. Mass.:56862.13
Organism:Homo sapiens (Human)
Description:P35368
Residue:520
BDBM50172991
NameBDBM50172991
Synonyms:CHEMBL3809781
TypeSmall organic molecule
Emp. Form.C24H31N3O5
Mol. Mass.441.52
SMILESCC(Cc1cc2CCN(CCCO)c2c(c1)C(N)=O)NCCOc1ccc2OCOc2c1