Reaction Details
TargetAlpha-1A adrenergic receptor
LigandBDBM50173117
Substrate/Competitorn/a
Meas. Tech.ChEMBL_1579180 (CHEMBL3812083)
IC50 4.4±n/a nM
Citation Zhao, FLi, JChen, YTian, YWu, CXie, YZhou, YWang, JXie, XLiu, H Design, Synthesis, and Biological Evaluation of Indoline and Indole Derivatives as Potent and Selectivea1A-Adrenoceptor Antagonists. J Med Chem59:3826-39 (2016) 
 
Alpha-1A adrenergic receptor
Name:Alpha-1A adrenergic receptor
Type:Cell-surface receptors
Mol. Mass.:51511.67
Organism:Homo sapiens (Human)
Description:P35348
Residue:466
BDBM50173117
NameBDBM50173117
Synonyms:CHEMBL3809319
TypeSmall organic molecule
Emp. Form.C24H31N3O4
Mol. Mass.425.5206
SMILESCOc1ccccc1OCCNC(C)Cc1cc(C(N)=O)c2n(CCCO)ccc2c1