Reaction Details
TargetAlpha-1D adrenergic receptor
LigandBDBM50173003
Substrate/Competitorn/a
Meas. Tech.ChEMBL_1579182 (CHEMBL3812085)
IC50 13±n/a nM
Citation Zhao, FLi, JChen, YTian, YWu, CXie, YZhou, YWang, JXie, XLiu, H Design, Synthesis, and Biological Evaluation of Indoline and Indole Derivatives as Potent and Selectivea1A-Adrenoceptor Antagonists. J Med Chem59:3826-39 (2016) 
 
Alpha-1D adrenergic receptor
Name:Alpha-1D adrenergic receptor
Type:Enzyme Catalytic Domain
Mol. Mass.:60485.82
Organism:Homo sapiens (Human)
Description:adrenergic Alpha1D ADRA1D HUMAN::P25100
Residue:572
BDBM50173003
NameBDBM50173003
Synonyms:CHEMBL3187195
TypeSmall organic molecule
Emp. Form.C25H32F3N3O4
Mol. Mass.495.5345
SMILESCC(Cc1cc2CCN(CCCO)c2c(c1)C(N)=O)NCCOc1ccccc1OCC(F)(F)F