Reaction Details
TargetAlpha-1B adrenergic receptor
LigandBDBM50172996
Substrate/Competitorn/a
Meas. Tech.ChEMBL_1579181 (CHEMBL3812084)
IC50 7583±n/a nM
Citation Zhao, FLi, JChen, YTian, YWu, CXie, YZhou, YWang, JXie, XLiu, H Design, Synthesis, and Biological Evaluation of Indoline and Indole Derivatives as Potent and Selectivea1A-Adrenoceptor Antagonists. J Med Chem59:3826-39 (2016) 
 
Alpha-1B adrenergic receptor
Name:Alpha-1B adrenergic receptor
Type:Enzyme
Mol. Mass.:56862.13
Organism:Homo sapiens (Human)
Description:P35368
Residue:520
BDBM50172996
NameBDBM50172996
Synonyms:CHEMBL3808717
TypeSmall organic molecule
Emp. Form.C27H34F3N3O4
Mol. Mass.521.5718
SMILESCCc1ccc(OCC(F)(F)F)c(OCCNC(C)Cc2cc(C(N)=O)c3n(CCCO)ccc3c2)c1