Reaction Details
TargetKappa-type opioid receptor
LigandBDBM50173127
Substrate/Competitorn/a
Meas. Tech.ChEMBL_1579559 (CHEMBL3810905)
Ki 33±n/a nM
Citation Guillemyn, KStarnowska, JLagard, CDyniewicz, JRojewska, EMika, JChung, NNUtard, VKosson, PLipkowski, AWChevillard, LArranz-Gibert, PTeixidó, MMegarbane, BTourwé, DSimonin, FPrzewlocka, BSchiller, PWBallet, S Bifunctional Peptide-Based Opioid Agonist-Nociceptin Antagonist Ligands for Dual Treatment of Acute and Neuropathic Pain. J Med Chem59:3777-92 (2016) 
 
Kappa-type opioid receptor
Name:Kappa-type opioid receptor
Type:G Protein-Coupled Receptor (GPCR)
Mol. Mass.:42648.76
Organism:Homo sapiens (Human)
Description:P41145
Residue:380
BDBM50173127
NameBDBM50173127
Synonyms:CHEMBL3808415
TypeSmall organic molecule
Emp. Form.C72H107N21O13
Mol. Mass.1474.7529
SMILESCC[C@H](C)[C@H](NC(=O)[C@H](CCCNC(N)=N)NC(=O)[C@H](Cc1ccc(O)cc1)NC(=O)[C@H](Cc1ccc(O)cc1)NC(=O)[C@H](CCCNC(N)=N)NC(=O)CCN1Cc2ccccc2C[C@H](NC(=O)[C@@H](CCCNC(N)=N)NC(=O)[C@@H](N)Cc2c(C)cc(O)cc2C)C1=O)C(=O)N[C@@H](CCCCN)C(N)=O