Reaction Details
TargetNociceptin receptor
LigandBDBM50173130
Substrate/Competitorn/a
Meas. Tech.ChEMBL_1579563 (CHEMBL3811073)
EC50>10000±n/a nM
Citation Guillemyn, KStarnowska, JLagard, CDyniewicz, JRojewska, EMika, JChung, NNUtard, VKosson, PLipkowski, AWChevillard, LArranz-Gibert, PTeixidó, MMegarbane, BTourwé, DSimonin, FPrzewlocka, BSchiller, PWBallet, S Bifunctional Peptide-Based Opioid Agonist-Nociceptin Antagonist Ligands for Dual Treatment of Acute and Neuropathic Pain. J Med Chem59:3777-92 (2016) 
 
Nociceptin receptor
Name:Nociceptin receptor
Type:G Protein-Coupled Receptor (GPCR)
Mol. Mass.:40702.87
Organism:Homo sapiens (Human)
Description:P41146
Residue:370
BDBM50173130
NameBDBM50173130
Synonyms:CHEMBL3808523
TypeSmall organic molecule
Emp. Form.C77H106N24O13
Mol. Mass.1575.8185
SMILESCc1cc(O)cc(C)c1C[C@H](N)C(=O)N[C@H](CCCNC(N)=N)C(=O)N[C@H]1Cc2ccccc2CN(CCC(=O)N[C@@H](CCCNC(N)=N)C(=O)N[C@@H](Cc2ccc(O)cc2)C(=O)N[C@@H](Cc2ccc(O)cc2)C(=O)N[C@@H](CCCNC(N)=N)C(=O)N[C@@H](Cc2c[nH]c3ccccc23)C(=O)N[C@@H](CCCNC(N)=N)C(N)=O)C1=O