Reaction Details
TargetG protein-coupled receptor kinase 5
LigandBDBM50173327
Substrate/Competitorn/a
Meas. Tech.ChEMBL_1581285 (CHEMBL3811362)
IC50 88000±n/a nM
Citation Waldschmidt, HVHoman, KTCruz-Rodríguez, OCato, MCWaninger-Saroni, JLarimore, KMCannavo, ASong, JCheung, JYKirchhoff, PDKoch, WJTesmer, JJLarsen, SD Structure-Based Design, Synthesis, and Biological Evaluation of Highly Selective and Potent G Protein-Coupled Receptor Kinase 2 Inhibitors. J Med Chem59:3793-807 (2016) 
 
G protein-coupled receptor kinase 5
Name:G protein-coupled receptor kinase 5
Type:PROTEIN
Mol. Mass.:67798.93
Organism:Homo sapiens (Human)
Description:ChEMBL_1280627
Residue:590
BDBM50173327
NameBDBM50173327
Synonyms:CHEMBL3808499 | US10023564, Example 28
TypeSmall organic molecule
Emp. Form.C30H29FN6O3
Mol. Mass.540.5881
SMILESCC1=C(C(NC(=O)N1)c1ccc(F)c(CC(=O)NCc2c(C)cccc2C)c1)C(=O)Nc1ccc2[nH]ncc2c1