Reaction Details
TargetG protein-coupled receptor kinase 5
LigandBDBM50173320
Substrate/Competitorn/a
Meas. Tech.ChEMBL_1581285 (CHEMBL3811362)
IC50>100000±n/a nM
Citation Waldschmidt, HVHoman, KTCruz-Rodríguez, OCato, MCWaninger-Saroni, JLarimore, KMCannavo, ASong, JCheung, JYKirchhoff, PDKoch, WJTesmer, JJLarsen, SD Structure-Based Design, Synthesis, and Biological Evaluation of Highly Selective and Potent G Protein-Coupled Receptor Kinase 2 Inhibitors. J Med Chem59:3793-807 (2016) 
 
G protein-coupled receptor kinase 5
Name:G protein-coupled receptor kinase 5
Type:PROTEIN
Mol. Mass.:67798.93
Organism:Homo sapiens (Human)
Description:ChEMBL_1280627
Residue:590
BDBM50173320
NameBDBM50173320
Synonyms:GSK-180736A US10023564, Compound GSK180736A
TypeSmall organic molecule
Emp. Form.C19H16FN5O2
Mol. Mass.365.361
SMILESCC1=C(C(NC(=O)N1)c1ccc(F)cc1)C(=O)Nc1ccc2[nH]ncc2c1