Reaction Details
TargetRhodopsin kinase GRK1
LigandBDBM50173323
Substrate/Competitorn/a
Meas. Tech.ChEMBL_1581284 (CHEMBL3811361)
IC50>100000±n/a nM
Citation Waldschmidt, HVHoman, KTCruz-Rodríguez, OCato, MCWaninger-Saroni, JLarimore, KMCannavo, ASong, JCheung, JYKirchhoff, PDKoch, WJTesmer, JJLarsen, SD Structure-Based Design, Synthesis, and Biological Evaluation of Highly Selective and Potent G Protein-Coupled Receptor Kinase 2 Inhibitors. J Med Chem59:3793-807 (2016) 
 
Rhodopsin kinase GRK1
Name:Rhodopsin kinase GRK1
Type:PROTEIN
Mol. Mass.:63520.09
Organism:Homo sapiens (Human)
Description:ChEMBL_774378
Residue:563
BDBM50173323
NameBDBM50173323
Synonyms:CHEMBL3808621 | US10023564, Example 2
TypeSmall organic molecule
Emp. Form.C27H21F3N6O3
Mol. Mass.534.4892
SMILESCC1=C(C(NC(=O)N1)c1ccc(F)c(c1)C(=O)NCc1c(F)cccc1F)C(=O)Nc1ccc2[nH]ncc2c1