Reaction Details
TargetRhodopsin kinase GRK1
LigandBDBM50173326
Substrate/Competitorn/a
Meas. Tech.ChEMBL_1581284 (CHEMBL3811361)
IC50>100000±n/a nM
Citation Waldschmidt, HVHoman, KTCruz-Rodríguez, OCato, MCWaninger-Saroni, JLarimore, KMCannavo, ASong, JCheung, JYKirchhoff, PDKoch, WJTesmer, JJLarsen, SD Structure-Based Design, Synthesis, and Biological Evaluation of Highly Selective and Potent G Protein-Coupled Receptor Kinase 2 Inhibitors. J Med Chem59:3793-807 (2016) 
 
Rhodopsin kinase GRK1
Name:Rhodopsin kinase GRK1
Type:PROTEIN
Mol. Mass.:63520.09
Organism:Homo sapiens (Human)
Description:ChEMBL_774378
Residue:563
BDBM50173326
NameBDBM50173326
Synonyms:CHEMBL3809604 | US10023564, Example 29
TypeSmall organic molecule
Emp. Form.C30H23F7N6O3
Mol. Mass.648.5308
SMILESCC1=C(C(NC(=O)N1)c1ccc(F)c(CC(=O)NCc2c(cccc2C(F)(F)F)C(F)(F)F)c1)C(=O)Nc1ccc2[nH]ncc2c1