Reaction Details
TargetRho-associated protein kinase 1
LigandBDBM50173325
Substrate/Competitorn/a
Meas. Tech.ChEMBL_1581288 (CHEMBL3811365)
IC50 57±n/a nM
Citation Waldschmidt, HVHoman, KTCruz-Rodríguez, OCato, MCWaninger-Saroni, JLarimore, KMCannavo, ASong, JCheung, JYKirchhoff, PDKoch, WJTesmer, JJLarsen, SD Structure-Based Design, Synthesis, and Biological Evaluation of Highly Selective and Potent G Protein-Coupled Receptor Kinase 2 Inhibitors. J Med Chem59:3793-807 (2016) 
 
Rho-associated protein kinase 1
Name:Rho-associated protein kinase 1
Type:Serine/threonine-protein kinase
Mol. Mass.:158156.77
Organism:Homo sapiens (Human)
Description:Q13464
Residue:1354
BDBM50173325
NameBDBM50173325
Synonyms:CHEMBL3809965 | US10023564, Example 5
TypeSmall organic molecule
Emp. Form.C28H25FN6O4
Mol. Mass.528.5343
SMILESCOc1ccccc1CNC(=O)c1cc(ccc1F)C1NC(=O)NC(C)=C1C(=O)Nc1ccc2[nH]ncc2c1