Reaction Details
TargetDual specificity protein kinase TTK
LigandBDBM50173331
Substrate/Competitorn/a
Meas. Tech.ChEBML_1581301
IC50>10000±n/a nM
Citation Innocenti, PWoodward, HLSolanki, SNaud, SWestwood, IMCronin, NHayes, ARoberts, JHenley, ATBaker, RFaisal, AMak, GWBox, GValenti, MDe Haven Brandon, AO'Fee, LSaville, HSchmitt, JMatijssen, BBurke, Rvan Montfort, RLRaynaud, FIEccles, SALinardopoulos, SBlagg, JHoelder, S Rapid Discovery of Pyrido[3,4-d]pyrimidine Inhibitors of Monopolar Spindle Kinase 1 (MPS1) Using a Structure-Based Hybridization Approach. J Med Chem59:3671-88 (2016) 
 
Dual specificity protein kinase TTK
Name:Dual specificity protein kinase TTK
Type:Protein
Mol. Mass.:97086.79
Organism:Homo sapiens (Human)
Description:P33981
Residue:857
BDBM50173331
NameBDBM50173331
Synonyms:CHEMBL3809531
TypeSmall organic molecule
Emp. Form.C18H16N6O
Mol. Mass.332.3592
SMILESCOc1ccc(Nc2ncc3ccnc(-c4cnn(C)c4)c3n2)cc1